Target
Aurora kinase B
Ligand
BDBM50318596
Substrate
Meas. Tech.
ChEMBL_633180 (CHEMBL1118617)
IC50
25±n/a nM
Citation
 Bavetsias, VLarge, JMSun, CBouloc, NKosmopoulou, MMatteucci, MWilsher, NEMartins, VReynisson, JAtrash, BFaisal, AUrban, FValenti, Mde Haven Brandon, ABox, GRaynaud, FIWorkman, PEccles, SABayliss, RBlagg, JLinardopoulos, SMcDonald, E Imidazo[4,5-b]pyridine derivatives as inhibitors of Aurora kinases: lead optimization studies toward the identification of an orally bioavailable preclinical development candidate. J Med Chem 53:5213-28 (2010)  
Target
Name:
Aurora kinase B
Synonyms:
AIK2 AIM1 ARK2 AURKB_HUMAN Aurora B-INCENP Aurora kinase B (AURKB) STK-1 STK12 Serine/threonine-protein kinase aurora B
Type:
Protein
Mol. Mass.:
39327.72
Organism:
Homo sapiens (Human)
Description:
Q96GD4
Residue:
344
  
Inhibitor
Name:
BDBM50318596
Synonyms:
3-((4-(6-Bromo-2-(4-(4-methylpiperazin-1-yl)phenyl)-3H-imidazo-[4,5-b]pyridin-7-yl)piperazin-1-yl)methyl)-5-methylisoxazole | CHEMBL1086579
Type:
Small organic molecule
Emp. Form.:
C20H27BrN8O
Mol. Mass.:
475.385
SMILES:
CN1CCN(CC1)c1nc2ncc(Br)c(N3CCN(Cc4cc(C)on4)CC3)c2[nH]1
: