Target
Aurora kinase A
Ligand
BDBM50318608
Substrate
Meas. Tech.
ChEMBL_633156 (CHEMBL1119040)
IC50
20±n/a nM
Citation
 Bavetsias, VLarge, JMSun, CBouloc, NKosmopoulou, MMatteucci, MWilsher, NEMartins, VReynisson, JAtrash, BFaisal, AUrban, FValenti, Mde Haven Brandon, ABox, GRaynaud, FIWorkman, PEccles, SABayliss, RBlagg, JLinardopoulos, SMcDonald, E Imidazo[4,5-b]pyridine derivatives as inhibitors of Aurora kinases: lead optimization studies toward the identification of an orally bioavailable preclinical development candidate. J Med Chem 53:5213-28 (2010)  
Target
Name:
Aurora kinase A
Synonyms:
AIK ARK1 AURKA AYK1 Aurora kinase A (AURA) Aurora kinase A (Aurora A) Aurora-related kinase 1 BTAK Breast-tumor-amplified kinase STK15 Serine/threonine kinase 15 Serine/threonine-protein kinase aurora A hARK1
Type:
Serine/threonine-protein kinase
Mol. Mass.:
45830.98
Organism:
Homo sapiens (Human)
Description:
O14965
Residue:
403
  
Inhibitor
Name:
BDBM50318608
Synonyms:
2-(4-(6-Chloro-7-(4-((5-methylisoxazol-3-yl)methyl)piperazin-1-yl)-3Himidazo[4,5-b]pyridin-2-yl)phenoxy)ethanol | CHEMBL1085387
Type:
Small organic molecule
Emp. Form.:
C23H25ClN6O3
Mol. Mass.:
468.936
SMILES:
Cc1cc(CN2CCN(CC2)c2c(Cl)cnc3nc([nH]c23)-c2ccc(OCCO)cc2)no1
: