Target
Rho-associated protein kinase 2
Ligand
BDBM50319713
Substrate
Meas. Tech.
ChEMBL_634831 (CHEMBL1120081)
IC50
4±n/a nM
Citation
 Bosanac, THickey, ERGinn, JKashem, MKerr, SKugler, SLi, XOlague, ASchlyer, SYoung, ER Substituted 2H-isoquinolin-1-ones as potent Rho-kinase inhibitors: part 3, aryl substituted pyrrolidines. Bioorg Med Chem Lett 20:3746-9 (2010)  
Target
Name:
Rho-associated protein kinase 2
Synonyms:
KIAA0619 ROCK2 Rho kinase 2 (ROCKII) Rho-associated protein kinase 2 (ROCK2) Rho-associated protein kinase 2/Transforming protein RhoA Rho-associated, coiled-coil-containing protein kinase II p164 ROCK-2
Type:
Protein
Mol. Mass.:
160885.43
Organism:
Homo sapiens (Human)
Description:
O75116
Residue:
1388
  
Inhibitor
Name:
BDBM50319713
Synonyms:
CHEMBL1084653 | rac-4-(4-bromophenyl)-N-(7-chloro-1-oxo-1,2-dihydroisoquinolin-6-yl)pyrrolidine-3-carboxamide
Type:
Small organic molecule
Emp. Form.:
C20H17BrClN3O2
Mol. Mass.:
446.725
SMILES:
Clc1cc2c(cc[nH]c2=O)cc1NC(=O)C1CNCC1c1ccc(Br)cc1
: