Target
Carbonic anhydrase 6
Ligand
BDBM10882
Substrate
Meas. Tech.
ChEMBL_635035 (CHEMBL1118586)
Ki
43±n/a nM
Citation
 Di Fiore, AMonti, SMInnocenti, AWinum, JYDe Simone, GSupuran, CT Carbonic anhydrase inhibitors: crystallographic and solution binding studies for the interaction of a boron-containing aromatic sulfamide with mammalian isoforms I-XV. Bioorg Med Chem Lett 20:3601-5 (2010)  
Target
Name:
Carbonic anhydrase 6
Synonyms:
CA-VI CAH6_HUMAN Carbonic Anhydrase VI Carbonic anhydrase 6 Carbonic anhydrase 6 (CA-VI) Salivary carbonic anhydrase | Secreted carbonic anhydrase
Type:
Enzyme
Mol. Mass.:
35371.40
Organism:
Homo sapiens (Human)
Description:
P23280
Residue:
308
  
Inhibitor
Name:
BDBM10882
Synonyms:
6-ethoxy-1,3-benzothiazole-2-sulfonamide Ethamide Ethoxzolamide Ethoxzolamide, EZM US10172837, Ethoxyzolamide | sulfonamide 3
Type:
Small organic molecule
Emp. Form.:
C9H10N2O3S2
Mol. Mass.:
258.317
SMILES:
CCOc1ccc2nc(sc2c1)S(N)(=O)=O
: