Target
Membrane-bound transcription factor site-1 protease
Ligand
BDBM50378790
Substrate
Meas. Tech.
ChEMBL_641529 (CHEMBL1175363)
Ki
75000±n/a nM
Citation
 Basak, AMitra, DDas, AKMohottalage, DBasak, A C(2)-Symmetric azobenzene-amino acid conjugates and their inhibition of Subtilisin Kexin Isozyme-1. Bioorg Med Chem Lett 20:3977-81 (2010)  
Target
Name:
Membrane-bound transcription factor site-1 protease
Synonyms:
KIAA0091 MBTPS1 SKI1
Type:
PROTEIN
Mol. Mass.:
117773.36
Organism:
Homo sapiens (Human)
Description:
ChEMBL_641529
Residue:
1052
  
Inhibitor
Name:
BDBM50378790
Synonyms:
CHEMBL1171759
Type:
Small organic molecule
Emp. Form.:
C26H32N4O8
Mol. Mass.:
528.5543
SMILES:
CC(C)[C@H](NC(=O)COc1ccccc1\N=N\c1ccccc1OCC(=O)N[C@@H](C(C)C)C(O)=O)C(O)=O
: