Target
Membrane-bound transcription factor site-1 protease
Ligand
BDBM50378791
Substrate
Meas. Tech.
ChEMBL_641529 (CHEMBL1175363)
Ki
225000±n/a nM
Citation
 Basak, AMitra, DDas, AKMohottalage, DBasak, A C(2)-Symmetric azobenzene-amino acid conjugates and their inhibition of Subtilisin Kexin Isozyme-1. Bioorg Med Chem Lett 20:3977-81 (2010)  
Target
Name:
Membrane-bound transcription factor site-1 protease
Synonyms:
KIAA0091 MBTPS1 SKI1
Type:
PROTEIN
Mol. Mass.:
117773.36
Organism:
Homo sapiens (Human)
Description:
ChEMBL_641529
Residue:
1052
  
Inhibitor
Name:
BDBM50378791
Synonyms:
CHEMBL1170119
Type:
Small organic molecule
Emp. Form.:
C34H32N4O8
Mol. Mass.:
624.6399
SMILES:
OC(=O)[C@H](Cc1ccccc1)NC(=O)COc1ccccc1\N=N\c1ccccc1OCC(=O)N[C@@H](Cc1ccccc1)C(O)=O
: