Target
MO15-related protein kinase Pfmrk
Ligand
BDBM50321442
Substrate
Meas. Tech.
ChEMBL_640752 (CHEMBL1175693)
IC50
11000±n/a nM
Citation
 Caridha, DKathcart, AKJirage, DWaters, NC Activity of substituted thiophene sulfonamides against malarial and mammalian cyclin dependent protein kinases. Bioorg Med Chem Lett 20:3863-7 (2010)  
Target
Name:
MO15-related protein kinase Pfmrk
Synonyms:
Protein kinase Pfmrk
Type:
PROTEIN
Mol. Mass.:
37992.30
Organism:
Plasmodium falciparum
Description:
ChEMBL_640752
Residue:
324
  
Inhibitor
Name:
BDBM50321442
Synonyms:
2,5-dichloro-N-(4-chloro-2-methylphenyl)benzenesulfonamide | CHEMBL1172130
Type:
Small organic molecule
Emp. Form.:
C13H10Cl3NO2S
Mol. Mass.:
350.648
SMILES:
Cc1cc(Cl)ccc1NS(=O)(=O)c1cc(Cl)ccc1Cl
: