Target
MO15-related protein kinase Pfmrk
Ligand
BDBM50321446
Substrate
Meas. Tech.
ChEMBL_640752 (CHEMBL1175693)
IC50
700±n/a nM
Citation
 Caridha, DKathcart, AKJirage, DWaters, NC Activity of substituted thiophene sulfonamides against malarial and mammalian cyclin dependent protein kinases. Bioorg Med Chem Lett 20:3863-7 (2010)  
Target
Name:
MO15-related protein kinase Pfmrk
Synonyms:
Protein kinase Pfmrk
Type:
PROTEIN
Mol. Mass.:
37992.30
Organism:
Plasmodium falciparum
Description:
ChEMBL_640752
Residue:
324
  
Inhibitor
Name:
BDBM50321446
Synonyms:
4-methyl-N-(3-(trifluoromethyl)phenyl)benzenesulfonamide | CHEMBL1170012
Type:
Small organic molecule
Emp. Form.:
C14H12F3NO2S
Mol. Mass.:
315.311
SMILES:
Cc1ccc(cc1)S(=O)(=O)Nc1cccc(c1)C(F)(F)F
: