Target
Adenosine receptor A2b
Ligand
BDBM50321528
Substrate
Meas. Tech.
ChEMBL_639627 (CHEMBL1175305)
IC50
40±n/a nM
Citation
 Cheung, AWBrinkman, JFirooznia, FFlohr, AGrimsby, JGubler, MLGuertin, KHamid, RMarcopulos, NNorcross, RDQi, LRamsey, GTan, JWen, YSarabu, R 4-Substituted-7-N-alkyl-N-acetyl 2-aminobenzothiazole amides: drug-like and non-xanthine based A2B adenosine receptor antagonists. Bioorg Med Chem Lett 20:4140-6 (2010)  
Target
Name:
Adenosine receptor A2b
Synonyms:
AA2BR_HUMAN ADORA2B Adenosine receptors A2b | Adenosine receptors; A2a & A2b
Type:
G Protein-Coupled Receptor (GPCR)
Mol. Mass.:
36341.22
Organism:
Homo sapiens (Human)
Description:
Residue:
332
  
Inhibitor
Name:
BDBM50321528
Synonyms:
4-fluoro-N-(4-methoxy-7-(N-(2,2,2-trifluoroethyl)acetamido)benzo[d]thiazol-2-yl)benzamide | CHEMBL1172269
Type:
Small organic molecule
Emp. Form.:
C19H15F4N3O3S
Mol. Mass.:
441.399
SMILES:
COc1ccc(N(CC(F)(F)F)C(C)=O)c2sc(NC(=O)c3ccc(F)cc3)nc12
: