Target
Adenosine receptor A1
Ligand
BDBM50321532
Substrate
Meas. Tech.
ChEMBL_639628 (CHEMBL1175306)
Ki
110±n/a nM
Citation
 Cheung, AWBrinkman, JFirooznia, FFlohr, AGrimsby, JGubler, MLGuertin, KHamid, RMarcopulos, NNorcross, RDQi, LRamsey, GTan, JWen, YSarabu, R 4-Substituted-7-N-alkyl-N-acetyl 2-aminobenzothiazole amides: drug-like and non-xanthine based A2B adenosine receptor antagonists. Bioorg Med Chem Lett 20:4140-6 (2010)  
Target
Name:
Adenosine receptor A1
Synonyms:
A1 adenosine receptor (hA1) AA1R_HUMAN ADORA1 Adenosine A1-receptor Adenosine receptor A1 (hA1) | Adenosine transporter (AdT)
Type:
G Protein-Coupled Receptor (GPCR)
Mol. Mass.:
36520.92
Organism:
Homo sapiens (Human)
Description:
P30542
Residue:
326
  
Inhibitor
Name:
BDBM50321532
Synonyms:
4-fluoro-N-(4-methoxy-7-(N-(2-methoxyethyl)acetamido)benzo[d]thiazol-2-yl)benzamide | CHEMBL1171526
Type:
Small organic molecule
Emp. Form.:
C20H20FN3O4S
Mol. Mass.:
417.454
SMILES:
COCCN(C(C)=O)c1ccc(OC)c2nc(NC(=O)c3ccc(F)cc3)sc12
: