Target
Adenosine receptor A2a
Ligand
BDBM50321535
Substrate
Meas. Tech.
ChEMBL_639629 (CHEMBL1175307)
Ki
160±n/a nM
Citation
 Cheung, AWBrinkman, JFirooznia, FFlohr, AGrimsby, JGubler, MLGuertin, KHamid, RMarcopulos, NNorcross, RDQi, LRamsey, GTan, JWen, YSarabu, R 4-Substituted-7-N-alkyl-N-acetyl 2-aminobenzothiazole amides: drug-like and non-xanthine based A2B adenosine receptor antagonists. Bioorg Med Chem Lett 20:4140-6 (2010)  
Target
Name:
Adenosine receptor A2a
Synonyms:
A2A adenosine receptor (hA2A) ADENOSINE A2 ADORA2 Adenosine A2A receptor (A2AAR)
Type:
G Protein-Coupled Receptor (GPCR)
Mol. Mass.:
44716.46
Organism:
Homo sapiens (Human)
Description:
P29274
Residue:
412
  
Inhibitor
Name:
BDBM50321535
Synonyms:
CHEMBL1170526 | N-(7-(N-(2-amino-2-oxoethyl)acetamido)-4-methoxybenzo[d]thiazol-2-yl)-4-fluorobenzamide
Type:
Small organic molecule
Emp. Form.:
C19H17FN4O4S
Mol. Mass.:
416.426
SMILES:
COc1ccc(N(CC(N)=O)C(C)=O)c2sc(NC(=O)c3ccc(F)cc3)nc12
: