Target
Dual specificity mitogen-activated protein kinase kinase 1
Ligand
BDBM50321560
Substrate
Meas. Tech.
ChEMBL_639648 (CHEMBL1175386)
IC50
72±n/a nM
Citation
 Wallace, MBAdams, MEKanouni, TMol, CDDougan, DRFeher, VAO'Connell, SMShi, LHalkowycz, PDong, Q Structure-based design and synthesis of pyrrole derivatives as MEK inhibitors. Bioorg Med Chem Lett 20:4156-8 (2010)  
Target
Name:
Dual specificity mitogen-activated protein kinase kinase 1
Synonyms:
Dual specificity mitogen-activated protein kinase (MEK) Dual specificity mitogen-activated protein kinase kinase 1 (MEK1) Dual specificity mitogen-activated protein kinase kinase MEK1/2 MAP kinase kinase 1 MAPK/ERK kinase 1 MEK-1 MP2K1_HUMAN PRKMK1 | VHL-MAP2K1/MAP2K2
Type:
Other Protein Type
Mol. Mass.:
43439.03
Organism:
Homo sapiens (Human)
Description:
Full-length human MEK-1 was generated by PCR and purified as a fusion protein from Escherichia coli lysates.
Residue:
393
  
Inhibitor
Name:
BDBM50321560
Synonyms:
1-acetyl-4-(2-fluoro-4-iodophenylamino)-5-methyl-1H-pyrrole-3-carboxylicacid | CHEMBL1170596
Type:
Small organic molecule
Emp. Form.:
C14H12FIN2O3
Mol. Mass.:
402.1596
SMILES:
CC(=O)n1cc(C(O)=O)c(Nc2ccc(I)cc2F)c1C
: