Target
Dual specificity mitogen-activated protein kinase kinase 1
Ligand
BDBM50321574
Substrate
Meas. Tech.
ChEMBL_639648 (CHEMBL1175386)
IC50
19±n/a nM
Citation
 Wallace, MBAdams, MEKanouni, TMol, CDDougan, DRFeher, VAO'Connell, SMShi, LHalkowycz, PDong, Q Structure-based design and synthesis of pyrrole derivatives as MEK inhibitors. Bioorg Med Chem Lett 20:4156-8 (2010)  
Target
Name:
Dual specificity mitogen-activated protein kinase kinase 1
Synonyms:
Dual specificity mitogen-activated protein kinase (MEK) Dual specificity mitogen-activated protein kinase kinase 1 (MEK1) Dual specificity mitogen-activated protein kinase kinase MEK1/2 MAP kinase kinase 1 MAPK/ERK kinase 1 MEK-1 MP2K1_HUMAN PRKMK1 | VHL-MAP2K1/MAP2K2
Type:
Other Protein Type
Mol. Mass.:
43439.03
Organism:
Homo sapiens (Human)
Description:
Full-length human MEK-1 was generated by PCR and purified as a fusion protein from Escherichia coli lysates.
Residue:
393
  
Inhibitor
Name:
BDBM50321574
Synonyms:
(S)-5-acetyl-N-(2,3-dihydroxypropoxy)-4-fluoro-2-(2-fluoro-4-iodophenylamino)-1-methyl-1H-pyrrole-3-carboxamide | CHEMBL1171015
Type:
Small organic molecule
Emp. Form.:
C17H18F2IN3O5
Mol. Mass.:
509.2432
SMILES:
CC(=O)c1c(F)c(C(=O)NOC[C@@H](O)CO)c(Nc2ccc(I)cc2F)n1C
: