Target
Platelet-derived growth factor receptor alpha
Ligand
BDBM50321892
Substrate
Meas. Tech.
ChEMBL_642111 (CHEMBL1176415)
IC50
0.980000±n/a nM
Citation
 Khanwelkar, RRChen, GSWang, HCYu, CWHuang, CHLee, OChen, CHHwang, CSKo, CHChou, NTLin, MWWang, LMChen, YCHseu, THChang, CNHsu, HCLin, HCShih, YCChou, SHTseng, HWLiu, CPTu, CMHu, TLTsai, YJChern, JW Synthesis and structure-activity relationship of 6-arylureido-3-pyrrol-2-ylmethylideneindolin-2-one derivatives as potent receptor tyrosine kinase inhibitors. Bioorg Med Chem 18:4674-86 (2011)  
Target
Name:
Platelet-derived growth factor receptor alpha
Synonyms:
Alpha-type platelet-derived growth factor receptor PDGFRA PGFRA_HUMAN Platelet-derived growth factor receptor alpha (PDGFRA) RHEPDGFRA
Type:
Protein
Mol. Mass.:
122633.38
Organism:
Homo sapiens (Human)
Description:
P16234
Residue:
1089
  
Inhibitor
Name:
BDBM50321892
Synonyms:
(Z)-5-{6-[3-(4-Methoxyphenyl)-ureido]-2-oxo-1,2-dihydroindol-3-ylidene-methyl}-4-methyl-1H-pyrrole-3-carboxylic acid | CHEMBL1173411
Type:
Small organic molecule
Emp. Form.:
C23H20N4O5
Mol. Mass.:
432.4287
SMILES:
COc1ccc(NC(=O)Nc2ccc3\C(=C\c4[nH]cc(C(O)=O)c4C)C(=O)Nc3c2)cc1
: