Target
Mast/stem cell growth factor receptor Kit
Ligand
BDBM50321894
Substrate
Meas. Tech.
ChEMBL_642159 (CHEMBL1176710)
IC50
6±n/a nM
Citation
 Khanwelkar, RRChen, GSWang, HCYu, CWHuang, CHLee, OChen, CHHwang, CSKo, CHChou, NTLin, MWWang, LMChen, YCHseu, THChang, CNHsu, HCLin, HCShih, YCChou, SHTseng, HWLiu, CPTu, CMHu, TLTsai, YJChern, JW Synthesis and structure-activity relationship of 6-arylureido-3-pyrrol-2-ylmethylideneindolin-2-one derivatives as potent receptor tyrosine kinase inhibitors. Bioorg Med Chem 18:4674-86 (2011)  
Target
Name:
Mast/stem cell growth factor receptor Kit
Synonyms:
CD117 antigen KIT Mast/stem cell growth factor receptor Kit (cKIT) Proto-oncogene tyrosine-protein kinase Kit Stem cell growth factor receptor Tyrosine-protein kinase Kit c-kit v-kit Hardy-Zuckerman 4 feline sarcoma viral oncogene homolog
Type:
Protein
Mol. Mass.:
109869.37
Organism:
Homo sapiens (Human)
Description:
P10721
Residue:
976
  
Inhibitor
Name:
BDBM50321894
Synonyms:
(Z)-2,4-Dimethyl-5-[2-oxo-6-(3-phenylureido)-1,2-dihydroindol-3-ylidene-methyl]-1H-pyrrole-3-carboxylic acid | CHEMBL1173107
Type:
Small organic molecule
Emp. Form.:
C23H20N4O4
Mol. Mass.:
416.4293
SMILES:
Cc1[nH]c(\C=C2/C(=O)Nc3cc(NC(=O)Nc4ccccc4)ccc23)c(C)c1C(O)=O
: