Target
Interleukin-5
Ligand
BDBM50242276
Substrate
Meas. Tech.
ChEMBL_642273 (CHEMBL1177153)
IC50
1400±n/a nM
Citation
 Thanigaimalai, PLee, KCSharma, VKYun, JHKim, YJung, SH Design and synthesis of novel hydroxyalkylaminomethylchromones for their IL-5 inhibitory activity. Bioorg Med Chem 18:4625-9 (2011)  
Target
Name:
Interleukin-5
Synonyms:
IL5_MOUSE Il5
Type:
PROTEIN
Mol. Mass.:
15414.97
Organism:
Mus musculus
Description:
ChEMBL_1464308
Residue:
133
  
Inhibitor
Name:
BDBM50242276
Synonyms:
CHEMBL486626 | Sophoricoside
Type:
Small organic molecule
Emp. Form.:
C21H20O10
Mol. Mass.:
432.3775
SMILES:
OC[C@H]1O[C@@H](Oc2ccc(cc2)-c2coc3cc(O)cc(O)c3c2=O)[C@H](O)[C@@H](O)[C@@H]1O
: