Target
Sodium- and chloride-dependent glycine transporter 1
Ligand
BDBM50322455
Substrate
Meas. Tech.
ChEMBL_643222 (CHEMBL1177033)
EC50
34±n/a nM
Citation
 Pinard, EAlanine, AAlberati, DBender, MBorroni, EBourdeaux, PBrom, VBurner, SFischer, HHainzl, DHalm, RHauser, NJolidon, SLengyel, JMarty, HPMeyer, TMoreau, JLMory, RNarquizian, RNettekoven, MNorcross, RDPuellmann, BSchmid, PSchmitt, SStalder, HWermuth, RWettstein, JGZimmerli, D Selective GlyT1 inhibitors: discovery of [4-(3-fluoro-5-trifluoromethylpyridin-2-yl)piperazin-1-yl][5-methanesulfonyl-2-((S)-2,2,2-trifluoro-1-methylethoxy)phenyl]methanone (RG1678), a promising novel medicine to treat schizophrenia. J Med Chem 53:4603-14 (2010)  
Target
Name:
Sodium- and chloride-dependent glycine transporter 1
Synonyms:
GlyT-1 Glycine Transporters (GlyT1c) SC6A9_HUMAN Sodium- and chloride-dependent glycine transporter 1 Sodium- and chloride-dependent glycine transporter 1 (GlyT1c) Solute carrier family 6 member 9
Type:
Enzyme
Mol. Mass.:
78270.54
Organism:
Homo sapiens (Human)
Description:
P48067
Residue:
706
  
Inhibitor
Name:
BDBM50322455
Synonyms:
3-Fluoro-4-[4-(5-methanesulfonyl-2-propoxy-benzoyl)-piperazin-1-yl]-benzonitrile | CHEMBL1173633
Type:
Small organic molecule
Emp. Form.:
C22H24FN3O4S
Mol. Mass.:
445.507
SMILES:
CCCOc1ccc(cc1C(=O)N1CCN(CC1)c1ccc(cc1F)C#N)S(C)(=O)=O
: