Target
Sodium-dependent dopamine transporter
Ligand
BDBM50322698
Substrate
Meas. Tech.
ChEMBL_642189 (CHEMBL1176740)
Ki
10±n/a nM
Citation
 Micheli, FCavanni, PAndreotti, DArban, RBenedetti, RBertani, BBettati, MBettelini, LBonanomi, GBraggio, SCarletti, RChecchia, ACorsi, MFazzolari, EFontana, SMarchioro, CMerlo-Pich, ENegri, MOliosi, BRatti, ERead, KDRoscic, MSartori, ISpada, STedesco, GTarsi, LTerreni, SVisentini, FZocchi, AZonzini, LDi Fabio, R 6-(3,4-dichlorophenyl)-1-[(methyloxy)methyl]-3-azabicyclo[4.1.0]heptane: a new potent and selective triple reuptake inhibitor. J Med Chem 53:4989-5001 (2010)  
Target
Name:
Sodium-dependent dopamine transporter
Synonyms:
DA transporter Dat1 SC6A3_MOUSE Sodium-dependent dopamine transporter | Solute carrier family 6 member 3
Type:
Enzyme Catalytic Domain
Mol. Mass.:
68809.06
Organism:
MOUSE
Description:
Dopamine Transporter SLC6A3 MOUSE::Q61327
Residue:
619
  
Inhibitor
Name:
BDBM50322698
Synonyms:
rel-1-(3,4-dichlorophenyl)-6-(methoxymethyl)-3-azabicyclo[4.1.0]heptane
Type:
Small organic molecule
Emp. Form.:
C14H17Cl2NO
Mol. Mass.:
286.197
SMILES:
COC[C@]12C[C@]1(CCNC2)c1ccc(Cl)c(Cl)c1
: