Target
Androgen receptor
Ligand
BDBM50323016
Substrate
Meas. Tech.
ChEMBL_643540 (CHEMBL1212404)
Ki
37±n/a nM
Citation
 Xiao, HYBalog, AAttar, RMFairfax, DFleming, LBHolst, CLMartin, GSRossiter, LMChen, JCvjic, MEDell-John, JGeng, JGottardis, MMHan, WCNation, AObermeier, MRizzo, CASchweizer, LSpires, TShan, WGavai, ASalvati, MEVite, G Design and synthesis of 4-[3,5-dioxo-11-oxa-4,9-diazatricyclo[5.3.1.0(2,6)]undec-4-yl]-2-trifluoromethyl-benzonitriles as androgen receptor antagonists. Bioorg Med Chem Lett 20:4491-5 (2010)  
Target
Name:
Androgen receptor
Synonyms:
ANDR_HUMAN Androgen Receptor Androgen receptor/Baculoviral IAP repeat-containing protein 2 Dihydrotestosterone receptor Nuclear receptor subfamily 3 group C member 4
Type:
Receptor
Mol. Mass.:
99185.27
Organism:
Homo sapiens (Human)
Description:
CHO cells were stably transfected with human AR gene.
Residue:
920
  
Inhibitor
Name:
BDBM50323016
Synonyms:
4-((1S,2S,6R,7R)-9-Hydroxy-1,7-dimethyl-3,5-dioxo-11-oxa-4,9-diaza-tricyclo[5.3.1.0*2,6*]undec-4-yl)-2-trifluoromethyl-benzonitrile | CHEMBL1210909
Type:
Small organic molecule
Emp. Form.:
C18H16F3N3O4
Mol. Mass.:
395.3325
SMILES:
C[C@@]12CN(O)C[C@@](C)(O1)c1c(O)n(c(O)c21)-c1ccc(C#N)c(c1)C(F)(F)F
: