Target
Beta-secretase 1
Ligand
BDBM50323214
Substrate
Meas. Tech.
ChEMBL_643854 (CHEMBL1211753)
IC50
>10000±n/a nM
Citation
 Sasaki, HMiki, KKinoshita, KKoyama, KJuliawaty, LDAchmad, SAHakim, EHKaneda, MTakahashi, K beta-Secretase (BACE-1) inhibitory effect of biflavonoids. Bioorg Med Chem Lett 20:4558-60 (2010)  
Target
Name:
Beta-secretase 1
Synonyms:
ASP2 Aspartyl protease 2 BACE1 Beta-secretase (BACE) Beta-secretase 1 (BACE 1) Beta-secretase 1 (BACE1) Beta-site amyloid precursor protein cleaving enzyme 1 Memapsin-2 beta-Secretase (BACE-1) | beta-Secretase (BACE1)
Type:
Protein
Mol. Mass.:
55755.10
Organism:
Homo sapiens (Human)
Description:
P56817
Residue:
501
  
Inhibitor
Name:
BDBM50323214
Synonyms:
6-[4-(5,7-Dihydroxy-4-oxo-4H-chromen-2-yl)-phenoxy]-5,7-dihydroxy-2-(4-hydroxy-phenyl)-chromen-4-one HINOKIFLAVONE
Type:
Small organic molecule
Emp. Form.:
C30H18O10
Mol. Mass.:
538.4579
SMILES:
Oc1ccc(cc1)-c1cc(=O)c2c(O)c(Oc3ccc(cc3)-c3cc(O)c4c(cc(O)cc4=O)o3)c(O)cc2o1
: