Target
Beta-secretase 1
Ligand
BDBM50323202
Substrate
Meas. Tech.
ChEMBL_643854 (CHEMBL1211753)
IC50
>10000±n/a nM
Citation
 Sasaki, HMiki, KKinoshita, KKoyama, KJuliawaty, LDAchmad, SAHakim, EHKaneda, MTakahashi, K beta-Secretase (BACE-1) inhibitory effect of biflavonoids. Bioorg Med Chem Lett 20:4558-60 (2010)  
Target
Name:
Beta-secretase 1
Synonyms:
ASP2 Aspartyl protease 2 BACE1 Beta-secretase (BACE) Beta-secretase 1 (BACE 1) Beta-secretase 1 (BACE1) Beta-site amyloid precursor protein cleaving enzyme 1 Memapsin-2 beta-Secretase (BACE-1) | beta-Secretase (BACE1)
Type:
Protein
Mol. Mass.:
55755.10
Organism:
Homo sapiens (Human)
Description:
P56817
Residue:
501
  
Inhibitor
Name:
BDBM50323202
Synonyms:
4',7''-O-methylamentoflavone 4',7''-di-O-methylamentoflavone | CHEMBL208988
Type:
Small organic molecule
Emp. Form.:
C32H22O10
Mol. Mass.:
566.5111
SMILES:
COc1ccc(cc1-c1c(OC)cc(O)c2c1oc(cc2=O)-c1ccc(O)cc1)-c1cc(O)c2c(cc(O)cc2=O)o1
: