Target
Neuronal acetylcholine receptor subunit alpha-7
Ligand
BDBM50166908
Substrate
Meas. Tech.
ChEMBL_645075 (CHEMBL1211581)
Ki
125±n/a nM
Citation
 Lowe, JADeNinno, SLCoe, JWZhang, LMente, SHurst, RSMather, RJWard, KMShrikhande, ARollema, HJohnson, DEHorner, WGorczyca, RTingley, FDKozak, RMajchrzak, MJTritto, TSadlier, JShaffer, CLEllerbrock, BOsgood, SMMacDougall, MCMcDowell, LL A novel series of [3.2.1] azabicyclic biaryl ethers as alpha3beta4 and alpha6/4beta4 nicotinic receptor agonists. Bioorg Med Chem Lett 20:4749-52 (2010)  
Target
Name:
Neuronal acetylcholine receptor subunit alpha-7
Synonyms:
ACHA7_HUMAN Cholinergic, Nicotinic Alpha7 Neuronal acetylcholine receptor protein alpha-7 subunit Nicotinic acetylcholine receptor alpha-7 (alpha7 nAChR)
Type:
Mol. Mass.:
56448.33
Organism:
Homo sapiens (Human)
Description:
CHRNA7 (NACHRA7)
Residue:
502
  
Inhibitor
Name:
BDBM50166908
Synonyms:
5,8,14-triazatetracyclo[10.3.1.02,11.04,9]hexadeca-2(11),3,5,7,9-pentaene; dihydrochloride US9993465, Varenicline | VARENICLINE
Type:
Small organic molecule
Emp. Form.:
C13H13N3
Mol. Mass.:
211.2624
SMILES:
C1C2CNCC1c1cc3nccnc3cc21
: