Target
Mineralocorticoid receptor
Ligand
BDBM50324201
Substrate
Meas. Tech.
ChEMBL_649964 (CHEMBL1219662)
IC50
6±n/a nM
Citation
 Meyers, MJArhancet, GBHockerman, SLChen, XLong, SAMahoney, MWRico, JRGarland, DJBlinn, JRCollins, JTYang, SHuang, HCMcGee, KFWendling, JMDietz, JDPayne, MAHomer, BLHeron, MIReitz, DBHu, X Discovery of (3S,3aR)-2-(3-chloro-4-cyanophenyl)-3-cyclopentyl-3,3a,4,5-tetrahydro-2H-benzo[g]indazole-7-carboxylic acid (PF-3882845), an orally efficacious mineralocorticoid receptor (MR) antagonist for hypertension and nephropathy. J Med Chem 53:5979-6002 (2010)  
Target
Name:
Mineralocorticoid receptor
Synonyms:
MCR MLR NR3C2 | Nuclear receptor subfamily 3 group C member 2
Type:
Enzyme
Mol. Mass.:
107076.42
Organism:
Homo sapiens (Human)
Description:
P08235
Residue:
984
  
Inhibitor
Name:
BDBM50324201
Synonyms:
4-[(5R)-1-(3-Chloro-4-cyanophenyl)-5-cyclopentyl-4,5-dihydro-1H-pyrazol-3-yl]-2-ethoxybenzoic Acid | CHEMBL1215197
Type:
Small organic molecule
Emp. Form.:
C24H24ClN3O3
Mol. Mass.:
437.919
SMILES:
CCOc1cc(ccc1C(O)=O)C1=NN([C@H](C1)C1CCCC1)c1ccc(C#N)c(Cl)c1
: