Target
[Pyruvate dehydrogenase (acetyl-transferring)] kinase isozyme 1, mitochondrial
Ligand
BDBM27344
Substrate
Meas. Tech.
ChEMBL_653820 (CHEMBL1226942)
IC50
>10000±n/a nM
Citation
 Montagnoli, AValsasina, BCroci, VMenichincheri, MRainoldi, SMarchesi, VTibolla, MTenca, PBrotherton, DAlbanese, CPatton, VAlzani, RCiavolella, ASola, FMolinari, AVolpi, DAvanzi, NFiorentini, FCattoni, MHealy, SBallinari, DPesenti, EIsacchi, AMoll, JBensimon, AVanotti, ESantocanale, C A Cdc7 kinase inhibitor restricts initiation of DNA replication and has antitumor activity. Nat Chem Biol 4:357-65 (2008)  
Target
Name:
[Pyruvate dehydrogenase (acetyl-transferring)] kinase isozyme 1, mitochondrial
Synonyms:
PDHK1 PDK1_HUMAN Pyruvate dehydrogenase kinase 1 (PDK1) | Pyruvate dehydrogenase kinase isoform 1
Type:
Protein
Mol. Mass.:
49255.23
Organism:
Homo sapiens (Human)
Description:
Q15118
Residue:
436
  
Inhibitor
Name:
BDBM27344
Synonyms:
2-(pyridin-4-yl)-1H,4H,5H,6H,7H-pyrrolo[3,2-c]pyridin-4-one Pyrrolopyridinone, 1
Type:
Small organic molecule
Emp. Form.:
C12H11N3O
Mol. Mass.:
213.2352
SMILES:
O=C1NCCc2[nH]c(cc12)-c1ccncc1
: