Target
Tyrosine-protein kinase Lck
Ligand
BDBM50129307
Substrate
Meas. Tech.
ChEMBL_660414 (CHEMBL1250004)
Ki
4±n/a nM
Citation
 Knight, ZAShokat, KM Features of selective kinase inhibitors. Chem Biol 12:621-37 (2005)  
Target
Name:
Tyrosine-protein kinase Lck
Synonyms:
2.7.10.2 LCK_HUMAN Leukocyte C-terminal Src kinase Lymphocyte-specific protein tyrosine kinase Protein YT16 Proto-oncogene tyrosine-protein kinase LCK T cell-specific protein-tyrosine kinase
Type:
Mol. Mass.:
57987.83
Organism:
Homo sapiens (Human)
Description:
P06239
Residue:
509
  
Inhibitor
Name:
BDBM50129307
Synonyms:
2-(3-tert-Butyl-ureido)-benzothiazole-6-carboxylic acid (2-chloro-6-methyl-phenyl)-amide | CHEMBL67237
Type:
Small organic molecule
Emp. Form.:
C20H21ClN4O2S
Mol. Mass.:
416.924
SMILES:
Cc1cccc(Cl)c1NC(=O)c1ccc2nc(NC(=O)NC(C)(C)C)sc2c1
: