Target
Dipeptidyl peptidase 2
Ligand
BDBM50326373
Substrate
Meas. Tech.
ChEMBL_657416 (CHEMBL1246392)
IC50
>100000±n/a nM
Citation
 Tsai, TYYeh, TKChen, XHsu, TJao, YCHuang, CHSong, JSHuang, YCChien, CHChiu, JHYen, SCTang, HKChao, YSJiaang, WT Substituted 4-carboxymethylpyroglutamic acid diamides as potent and selective inhibitors of fibroblast activation protein. J Med Chem 53:6572-83 (2010)  
Target
Name:
Dipeptidyl peptidase 2
Synonyms:
DAP II DPP2_HUMAN Dipeptidyl aminopeptidase II Dipeptidyl peptidase 2 (DPP2) Dipeptidyl peptidase II (DPP II) Dipeptidyl peptidase II and dipeptidyl peptidase IV (DPP2 and DPP4) carboxytripeptidase dipeptidyl(amino)peptidase II | dipeptidylarylamidase
Type:
Protein
Mol. Mass.:
54339.29
Organism:
Homo sapiens (Human)
Description:
Q9UHL4
Residue:
492
  
Inhibitor
Name:
BDBM50326373
Synonyms:
(R)-1-(2-(1-naphthamido)acetyl)pyrrolidin-2-ylboronic acid | CHEMBL1243373
Type:
Small organic molecule
Emp. Form.:
C17H19BN2O4
Mol. Mass.:
326.155
SMILES:
OB(O)[C@@H]1CCCN1C(=O)CNC(=O)c1cccc2ccccc12
: