Target
Dipeptidyl peptidase 2
Ligand
BDBM50326376
Substrate
Meas. Tech.
ChEMBL_657416 (CHEMBL1246392)
IC50
>100000±n/a nM
Citation
 Tsai, TYYeh, TKChen, XHsu, TJao, YCHuang, CHSong, JSHuang, YCChien, CHChiu, JHYen, SCTang, HKChao, YSJiaang, WT Substituted 4-carboxymethylpyroglutamic acid diamides as potent and selective inhibitors of fibroblast activation protein. J Med Chem 53:6572-83 (2010)  
Target
Name:
Dipeptidyl peptidase 2
Synonyms:
DAP II DPP2_HUMAN Dipeptidyl aminopeptidase II Dipeptidyl peptidase 2 (DPP2) Dipeptidyl peptidase II (DPP II) Dipeptidyl peptidase II and dipeptidyl peptidase IV (DPP2 and DPP4) carboxytripeptidase dipeptidyl(amino)peptidase II | dipeptidylarylamidase
Type:
Protein
Mol. Mass.:
54339.29
Organism:
Homo sapiens (Human)
Description:
Q9UHL4
Residue:
492
  
Inhibitor
Name:
BDBM50326376
Synonyms:
(S)-1-((2S,4R)-4-(2-(isoindolin-2-yl)-2-oxoethyl)-5-oxopyrrolidine-2-carbonyl)pyrrolidine-2-carbonitrile | CHEMBL1243403
Type:
Small organic molecule
Emp. Form.:
C20H22N4O3
Mol. Mass.:
366.4137
SMILES:
O=C(C[C@H]1C[C@H](NC1=O)C(=O)N1CCC[C@H]1C#N)N1Cc2ccccc2C1
: