Target
Cyclin-dependent kinase 4
Ligand
BDBM50378822
Substrate
Meas. Tech.
ChEMBL_660568 (CHEMBL1250276)
IC50
810±n/a nM
Citation
 Sridhar, JAkula, NPattabiraman, N Selectivity and potency of cyclin-dependent kinase inhibitors. AAPS J 8:204-21 (2006)  
Target
Name:
Cyclin-dependent kinase 4
Synonyms:
CDK4 Cell division protein kinase 4 PSK-J3
Type:
Enzyme Subunit
Mol. Mass.:
33731.96
Organism:
Homo sapiens (Human)
Description:
P11802
Residue:
303
  
Inhibitor
Name:
BDBM50378822
Synonyms:
CHEMBL1241662
Type:
Small organic molecule
Emp. Form.:
C21H13ClF3N3O
Mol. Mass.:
415.796
SMILES:
Nc1nc2ccc(cc2n1Cc1c(F)cccc1F)C(=O)c1c(F)cccc1Cl
: