Target
Cyclin-dependent kinase 4
Ligand
BDBM50378823
Substrate
Meas. Tech.
ChEMBL_660568 (CHEMBL1250276)
IC50
260±n/a nM
Citation
 Sridhar, JAkula, NPattabiraman, N Selectivity and potency of cyclin-dependent kinase inhibitors. AAPS J 8:204-21 (2006)  
Target
Name:
Cyclin-dependent kinase 4
Synonyms:
CDK4 Cell division protein kinase 4 PSK-J3
Type:
Enzyme Subunit
Mol. Mass.:
33731.96
Organism:
Homo sapiens (Human)
Description:
P11802
Residue:
303
  
Inhibitor
Name:
BDBM50378823
Synonyms:
CHEMBL1241849
Type:
Small organic molecule
Emp. Form.:
C23H25N5O2S
Mol. Mass.:
435.542
SMILES:
CN(C)CCNS(=O)(=O)c1ccc(Nc2cccc(c2)-c2cnc3ccccn23)cc1
: