Target
Receptor-type tyrosine-protein phosphatase alpha
Ligand
BDBM50326562
Substrate
Meas. Tech.
ChEMBL_661806 (CHEMBL1252122)
pH
7±n/a
IC50
4000±n/a nM
Comments
extracted
Citation
 Homan, KTBalasubramaniam, DZabell, APWiest, OHelquist, PStauffacher, CV Identification of novel inhibitors for a low molecular weight protein tyrosine phosphatase via virtual screening. Bioorg Med Chem 18:5449-56 (2010)  
Target
Name:
Receptor-type tyrosine-protein phosphatase alpha
Synonyms:
PTPA PTPRA_HUMAN Protein-tyrosine phosphatase alpha
Type:
Enzyme
Mol. Mass.:
90719.02
Organism:
Homo sapiens (Human)
Description:
P18433
Residue:
802
  
Inhibitor
Name:
BDBM50326562
Synonyms:
8-phenyl-1-thia-4,8-diazaspiro[4.5]decane-3-carboxylic acid | CHEMBL1253342
Type:
Small organic molecule
Emp. Form.:
C14H18N2O2S
Mol. Mass.:
278.37
SMILES:
OC(=O)C1CSC2(CCN(CC2)c2ccccc2)N1
: