Target
Macrophage migration inhibitory factor
Ligand
BDBM50326571
Substrate
Meas. Tech.
ChEMBL_661807 (CHEMBL1252123)
IC50
9500±n/a nM
Citation
 El Turk, FFauvet, BOuertatani-Sakouhi, HLugari, ABetzi, SRoche, PMorelli, XLashuel, HA An integrative in silico methodology for the identification of modulators of macrophage migration inhibitory factor (MIF) tautomerase activity. Bioorg Med Chem 18:5425-40 (2010)  
Target
Name:
Macrophage migration inhibitory factor
Synonyms:
GIF Glycosylation-inhibiting factor L-dopachrome tautomerase MIF/CD74 (Macrophage migration inhibitory factor and HLA-DR antigens-associated invariant chain) MMIF Macrophage migration inhibitory factor (MIF) | Phenylpyruvate tautomerase
Type:
Enzyme
Mol. Mass.:
12478.18
Organism:
Homo sapiens (Human)
Description:
P14174
Residue:
115
  
Inhibitor
Name:
BDBM50326571
Synonyms:
5-(2-nitro-4-(trifluoromethylsulfonyl)phenylthio)-1,3,4-thiadiazole-2(3H)-thione | CHEMBL1254441
Type:
Small organic molecule
Emp. Form.:
C9H4F3N3O4S4
Mol. Mass.:
403.401
SMILES:
[O-][N+](=O)c1cc(ccc1Sc1nnc(S)s1)S(=O)(=O)C(F)(F)F
: