Target
Galectin-9
Ligand
BDBM21533
Substrate
Meas. Tech.
ChEMBL_661838 (CHEMBL1252154)
Kd
490000±n/a nM
Citation
 Salameh, BACumpstey, ISundin, ALeffler, HNilsson, UJ 1H-1,2,3-triazol-1-yl thiodigalactoside derivatives as high affinity galectin-3 inhibitors. Bioorg Med Chem 18:5367-78 (2010)  
Target
Name:
Galectin-9
Synonyms:
LEG9_HUMAN | LGALS9
Type:
PROTEIN
Mol. Mass.:
39532.33
Organism:
Homo sapiens (Human)
Description:
ChEMBL_1454626
Residue:
355
  
Inhibitor
Name:
BDBM21533
Synonyms:
N-[(2R,3R,4R,5S,6R)-4-hydroxy-6-(hydroxymethyl)-2-methoxy-5-{[(2S,3R,4S,5R,6R)-3,4,5-trihydroxy-6-(hydroxymethyl)oxan-2-yl]oxy}oxan-3-yl]acetamide | Thioureido N-acetyllactosamine derivative, 17
Type:
Emp. Form.:
C15H27NO11
Mol. Mass.:
397.375
SMILES:
CO[C@@H]1O[C@H](CO)[C@@H](O[C@@H]2O[C@H](CO)[C@H](O)[C@H](O)[C@H]2O)[C@H](O)[C@H]1NC(C)=O
: