Target
Galectin-9
Ligand
BDBM50326599
Substrate
Meas. Tech.
ChEMBL_661838 (CHEMBL1252154)
Kd
>100000±n/a nM
Citation
 Salameh, BACumpstey, ISundin, ALeffler, HNilsson, UJ 1H-1,2,3-triazol-1-yl thiodigalactoside derivatives as high affinity galectin-3 inhibitors. Bioorg Med Chem 18:5367-78 (2010)  
Target
Name:
Galectin-9
Synonyms:
LEG9_HUMAN | LGALS9
Type:
PROTEIN
Mol. Mass.:
39532.33
Organism:
Homo sapiens (Human)
Description:
ChEMBL_1454626
Residue:
355
  
Inhibitor
Name:
BDBM50326599
Synonyms:
CHEMBL1254013 | Methyl-3'-naphthyl-2-amido-Lactoe-N-Acyl
Type:
Small organic molecule
Emp. Form.:
C26H34N2O11
Mol. Mass.:
550.555
SMILES:
CO[C@@H]1O[C@H](CO)[C@@H](O[C@@H]2O[C@H](CO)[C@H](O)[C@H](NC(=O)c3ccc4ccccc4c3)[C@H]2O)[C@H](O)[C@H]1NC(C)=O
: