Target
Galectin-9
Ligand
BDBM50326602
Substrate
Meas. Tech.
ChEMBL_661838 (CHEMBL1252154)
Kd
1300000±n/a nM
Citation
 Salameh, BACumpstey, ISundin, ALeffler, HNilsson, UJ 1H-1,2,3-triazol-1-yl thiodigalactoside derivatives as high affinity galectin-3 inhibitors. Bioorg Med Chem 18:5367-78 (2010)  
Target
Name:
Galectin-9
Synonyms:
LEG9_HUMAN | LGALS9
Type:
PROTEIN
Mol. Mass.:
39532.33
Organism:
Homo sapiens (Human)
Description:
ChEMBL_1454626
Residue:
355
  
Inhibitor
Name:
BDBM50326602
Synonyms:
CHEMBL1254599 | Methyl-3-deoxy-3-(4-phenyl-1H-[1,2,3]-triazol-1-yl)-1-thio-beta-D-galactopyranoside
Type:
Small organic molecule
Emp. Form.:
C15H19N3O4S
Mol. Mass.:
337.394
SMILES:
CS[C@@H]1O[C@H](CO)[C@H](O)[C@@H]([C@H]1O)n1cc(nn1)-c1ccccc1
: