Target
Galectin-9
Ligand
BDBM50326607
Substrate
Meas. Tech.
ChEMBL_661838 (CHEMBL1252154)
Kd
330000±n/a nM
Citation
 Salameh, BACumpstey, ISundin, ALeffler, HNilsson, UJ 1H-1,2,3-triazol-1-yl thiodigalactoside derivatives as high affinity galectin-3 inhibitors. Bioorg Med Chem 18:5367-78 (2010)  
Target
Name:
Galectin-9
Synonyms:
LEG9_HUMAN | LGALS9
Type:
PROTEIN
Mol. Mass.:
39532.33
Organism:
Homo sapiens (Human)
Description:
ChEMBL_1454626
Residue:
355
  
Inhibitor
Name:
BDBM50326607
Synonyms:
CHEMBL1254761 | Methyl-3-deoxy-3-(4-p-tolylsulfonyl-1H-[1,2,3]-triazol-1-yl)-1-thio-beta-D-galactopyranoside
Type:
Small organic molecule
Emp. Form.:
C16H21N3O6S2
Mol. Mass.:
415.484
SMILES:
CS[C@@H]1O[C@H](CO)[C@H](O)[C@@H]([C@H]1O)n1cc(nn1)S(=O)(=O)c1ccc(C)cc1
: