Target
Acetylcholinesterase
Ligand
BDBM50017233
Substrate
Meas. Tech.
ChEMBL_662057 (CHEMBL1251789)
Ki
25000±n/a nM
Citation
 Schuster, DSpetea, MMusic, MRief, SFink, MKirchmair, JSchütz, JWolber, GLanger, TStuppner, HSchmidhammer, HRollinger, JM Morphinans and isoquinolines: acetylcholinesterase inhibition, pharmacophore modeling, and interaction with opioid receptors. Bioorg Med Chem 18:5071-80 (2010)  
Target
Name:
Acetylcholinesterase
Synonyms:
ACES_ELEEL Acetylcholinesterase (EeAChE) | ache
Type:
Enzyme
Mol. Mass.:
71812.79
Organism:
Electrophorus electricus (Electric eel)
Description:
Residue:
633
  
Inhibitor
Name:
BDBM50017233
Synonyms:
CHEMBL592 LEVORPHANOL
Type:
Small organic molecule
Emp. Form.:
C17H23NO
Mol. Mass.:
257.3706
SMILES:
CN1CC[C@]23CCCC[C@H]2[C@H]1Cc1ccc(O)cc31
: