Target
Glucocorticoid receptor
Ligand
BDBM50326959
Substrate
Meas. Tech.
ChEMBL_663368 (CHEMBL1250864)
IC50
12±n/a nM
Citation
 Riether, DHarcken, CRazavi, HKuzmich, DGilmore, TBentzien, JPack, EJSouza, DNelson, RMKukulka, AFadra, TNZuvela-Jelaska, LPelletier, JDinallo, RPanzenbeck, MTorcellini, CNabozny, GHThomson, DS Nonsteroidal dissociated glucocorticoid agonists containing azaindoles as steroid A-ring mimetics. J Med Chem 53:6681-98 (2010)  
Target
Name:
Glucocorticoid receptor
Synonyms:
GCR_HUMAN GRL Glucocorticoid receptor (GRFP) Nuclear receptor subfamily 3 group C member 1
Type:
Enzyme
Mol. Mass.:
85656.87
Organism:
Homo sapiens (Human)
Description:
P04150
Residue:
777
  
Inhibitor
Name:
BDBM50326959
Synonyms:
1,1,1-Trifluoro-4-(4-methoxybiphenyl-3-yl)-4-methyl-2-(1H-pyrrolo[2,3-c]pyridin-2-ylmethyl)pentan-2-ol | CHEMBL1254080
Type:
Small organic molecule
Emp. Form.:
C27H27F3N2O2
Mol. Mass.:
468.5107
SMILES:
COc1ccc(cc1C(C)(C)CC(O)(Cc1cc2ccncc2[nH]1)C(F)(F)F)-c1ccccc1
: