Target
Glucocorticoid receptor
Ligand
BDBM50326946
Substrate
Meas. Tech.
ChEMBL_663371 (CHEMBL1250867)
IC50
3.3±n/a nM
Citation
 Riether, DHarcken, CRazavi, HKuzmich, DGilmore, TBentzien, JPack, EJSouza, DNelson, RMKukulka, AFadra, TNZuvela-Jelaska, LPelletier, JDinallo, RPanzenbeck, MTorcellini, CNabozny, GHThomson, DS Nonsteroidal dissociated glucocorticoid agonists containing azaindoles as steroid A-ring mimetics. J Med Chem 53:6681-98 (2010)  
Target
Name:
Glucocorticoid receptor
Synonyms:
GCR_HUMAN GRL Glucocorticoid receptor (GRFP) Nuclear receptor subfamily 3 group C member 1
Type:
Enzyme
Mol. Mass.:
85656.87
Organism:
Homo sapiens (Human)
Description:
P04150
Residue:
777
  
Inhibitor
Name:
BDBM50326946
Synonyms:
4-Fluoro-2-[(R)-4,4,4-trifluoro-3-hydroxy-1,1-dimethyl-3-(1H-pyrrolo[2,3-c]pyridin-2-ylmethyl)butyl]phenol | CHEMBL1253898
Type:
Small organic molecule
Emp. Form.:
C20H20F4N2O2
Mol. Mass.:
396.3786
SMILES:
CC(C)(C[C@@](O)(Cc1cc2ccncc2[nH]1)C(F)(F)F)c1cc(F)ccc1O
: