Target
Coagulation factor X
Ligand
BDBM50328717
Substrate
Meas. Tech.
ChEMBL_675275 (CHEMBL1273257)
Ki
0.057±n/a nM
Citation
 Pinto, DJSmallheer, JMCheney, DLKnabb, RMWexler, RR Factor Xa inhibitors: next-generation antithrombotic agents. J Med Chem 53:6243-74 (2010)  
Target
Name:
Coagulation factor X
Synonyms:
Activated coagulation factor X (FXa) Coagulation factor X precursor F10 Factor X heavy chain Factor Xa Stuart-Prower factor
Type:
Enzyme
Mol. Mass.:
54726.60
Organism:
Homo sapiens (Human)
Description:
Residue:
488
  
Inhibitor
Name:
BDBM50328717
Synonyms:
5-Chloro-N-(5-chloro-pyridin-2-yl)-3-methoxy-2-[4-(2-oxo-piperidin-1-yl)-benzoylamino]-benzamide CHEMBL260085
Type:
Small organic molecule
Emp. Form.:
C25H22Cl2N4O4
Mol. Mass.:
513.373
SMILES:
COc1cc(Cl)cc(C(=O)Nc2ccc(Cl)cn2)c1NC(=O)c1ccc(cc1)N1CCCCC1=O
: