Target
Coagulation factor X
Ligand
BDBM50142146
Substrate
Meas. Tech.
ChEMBL_675275 (CHEMBL1273257)
Ki
1.3±n/a nM
Citation
 Pinto, DJSmallheer, JMCheney, DLKnabb, RMWexler, RR Factor Xa inhibitors: next-generation antithrombotic agents. J Med Chem 53:6243-74 (2010)  
Target
Name:
Coagulation factor X
Synonyms:
Activated coagulation factor X (FXa) Coagulation factor X precursor F10 Factor X heavy chain Factor Xa Stuart-Prower factor
Type:
Enzyme
Mol. Mass.:
54726.60
Organism:
Homo sapiens (Human)
Description:
Residue:
488
  
Inhibitor
Name:
BDBM50142146
Synonyms:
5-Chloro-N-(5-chloro-pyridin-2-yl)-2-(4-dimethylaminomethyl-benzoylamino)-benzamide | CHEMBL369086
Type:
Small organic molecule
Emp. Form.:
C22H20Cl2N4O2
Mol. Mass.:
443.326
SMILES:
CN(C)Cc1ccc(cc1)C(=O)Nc1ccc(Cl)cc1C(=O)Nc1ccc(Cl)cn1
: