Target
Coagulation factor X
Ligand
BDBM12864
Substrate
Meas. Tech.
ChEMBL_675275 (CHEMBL1273257)
Ki
0.17±n/a nM
Citation
 Pinto, DJSmallheer, JMCheney, DLKnabb, RMWexler, RR Factor Xa inhibitors: next-generation antithrombotic agents. J Med Chem 53:6243-74 (2010)  
Target
Name:
Coagulation factor X
Synonyms:
Activated coagulation factor X (FXa) Coagulation factor X precursor F10 Factor X heavy chain Factor Xa Stuart-Prower factor
Type:
Enzyme
Mol. Mass.:
54726.60
Organism:
Homo sapiens (Human)
Description:
Residue:
488
  
Inhibitor
Name:
BDBM12864
Synonyms:
1-(3-amino-1,2-benzoxazol-5-yl)-6-(4-{2-[(dimethylamino)methyl]phenyl}phenyl)-5-methyl-3-(trifluoromethyl)-1H,6H,7H-pyrazolo[4,3-d]pyrimidin-7-one | Pyrazolo[4,3-d]pyrimidinone 23b
Type:
Small organic molecule
Emp. Form.:
C29H24F3N7O2
Mol. Mass.:
559.5418
SMILES:
CN(C)Cc1ccccc1-c1ccc(cc1)-n1c(C)nc2c(nn(-c3ccc4onc(N)c4c3)c2c1=O)C(F)(F)F
: