Target
Coagulation factor X
Ligand
BDBM13279
Substrate
Meas. Tech.
ChEMBL_675275 (CHEMBL1273257)
Ki
7±n/a nM
Citation
 Pinto, DJSmallheer, JMCheney, DLKnabb, RMWexler, RR Factor Xa inhibitors: next-generation antithrombotic agents. J Med Chem 53:6243-74 (2010)  
Target
Name:
Coagulation factor X
Synonyms:
Activated coagulation factor X (FXa) Coagulation factor X precursor F10 Factor X heavy chain Factor Xa Stuart-Prower factor
Type:
Enzyme
Mol. Mass.:
54726.60
Organism:
Homo sapiens (Human)
Description:
Residue:
488
  
Inhibitor
Name:
BDBM13279
Synonyms:
4-{[(3S)-3-[(7-methoxynaphthalene-2-)(methyl)sulfonamido]-2-oxopyrrolidin-1-yl]methyl}thiophene-2-carboximidamide CHEMBL84638 Sulfonamidopyrrolidinone
Type:
Small organic molecule
Emp. Form.:
C22H24N4O4S2
Mol. Mass.:
472.58
SMILES:
COc1ccc2ccc(cc2c1)S(=O)(=O)N(C)[C@H]1CCN(Cc2csc(c2)C(N)=N)C1=O
: