Target
Coagulation factor X
Ligand
BDBM50066614
Substrate
Meas. Tech.
ChEMBL_675285 (CHEMBL1273267)
Ki
610±n/a nM
Citation
 Pinto, DJSmallheer, JMCheney, DLKnabb, RMWexler, RR Factor Xa inhibitors: next-generation antithrombotic agents. J Med Chem 53:6243-74 (2010)  
Target
Name:
Coagulation factor X
Synonyms:
Coagulation factor X FA10_BOVIN | Factor Xa (fXa)
Type:
PROTEIN
Mol. Mass.:
54498.45
Organism:
Bos taurus
Description:
ChEMBL_1364435
Residue:
492
  
Inhibitor
Name:
BDBM50066614
Synonyms:
(E,E)-2,7-Bis(4-amidinobenzylidine)cycloheptan-1-one CHEMBL48233
Type:
Small organic molecule
Emp. Form.:
C23H24N4O
Mol. Mass.:
372.4629
SMILES:
NC(=N)c1ccc(\C=C2/CCCC\C(=C/c3ccc(cc3)C(N)=N)C2=O)cc1
: