Target
Coagulation factor X
Ligand
BDBM12596
Substrate
Meas. Tech.
ChEMBL_675275 (CHEMBL1273257)
Ki
1.1±n/a nM
Citation
 Pinto, DJSmallheer, JMCheney, DLKnabb, RMWexler, RR Factor Xa inhibitors: next-generation antithrombotic agents. J Med Chem 53:6243-74 (2010)  
Target
Name:
Coagulation factor X
Synonyms:
Activated coagulation factor X (FXa) Coagulation factor X precursor F10 Factor X heavy chain Factor Xa Stuart-Prower factor
Type:
Enzyme
Mol. Mass.:
54726.60
Organism:
Homo sapiens (Human)
Description:
Residue:
488
  
Inhibitor
Name:
BDBM12596
Synonyms:
4-{[(E)-2-(5-CHLOROTHIEN-2-YL)VINYL]SULFONYL}-1-(1H-PYRROLO[3,2-C]PYRIDIN-2-YLMETHYL)PIPERAZIN-2-ONE CHEMBL423417 RPR209685
Type:
Small organic molecule
Emp. Form.:
C18H17ClN4O3S2
Mol. Mass.:
436.936
SMILES:
Clc1ccc(C=CS(=O)(=O)N2CCN(Cc3cc4cnccc4[nH]3)C(=O)C2)s1
: