Target
Vitamin D3 receptor
Ligand
BDBM50329707
Substrate
Meas. Tech.
ChEMBL_675521 (CHEMBL1273734)
Ki
11±n/a nM
Citation
 Maruyama, KNoguchi-Yachide, TSugita, KHashimoto, YIshikawa, M Novel selective anti-androgens with a diphenylpentane skeleton. Bioorg Med Chem Lett 20:6661-6 (2010)  
Target
Name:
Vitamin D3 receptor
Synonyms:
1,25-dihydroxyvitamin D3 receptor Nuclear receptor subfamily 1 group I member 1 VDR | VDR_HUMAN
Type:
Protein
Mol. Mass.:
48288.72
Organism:
Homo sapiens (Human)
Description:
P11473
Residue:
427
  
Inhibitor
Name:
BDBM50329707
Synonyms:
(S)-3-(4-(3-(4-((S)-2-hydroxy-3,3-dimethylbutoxy)-3-methylphenyl)pentan-3-yl)-2-methylphenoxy)propane-1,2-diol | CHEMBL403885
Type:
Small organic molecule
Emp. Form.:
C28H42O5
Mol. Mass.:
458.6301
SMILES:
CCC(CC)(c1ccc(OC[C@@H](O)CO)c(C)c1)c1ccc(OC[C@@H](O)C(C)(C)C)c(C)c1
: