Target
Peptidyl-prolyl cis-trans isomerase B
Ligand
BDBM50330183
Substrate
Meas. Tech.
ChEMBL_676204 (CHEMBL1273324)
IC50
30.5±n/a nM
Citation
 Scribner, AHouck, DHuang, ZMosier, SPeel, MScorneaux, B Synthesis and biological evaluation of [D-lysine]8cyclosporin A analogs as potential anti-HCV agents. Bioorg Med Chem Lett 20:6542-6 (2010)  
Target
Name:
Peptidyl-prolyl cis-trans isomerase B
Synonyms:
CYP-S1 Cyclophilin B PPIB PPIase Rotamase SCYLP
Type:
Protein
Mol. Mass.:
23751.82
Organism:
Homo sapiens (Human)
Description:
P23284
Residue:
216
  
Inhibitor
Name:
BDBM50330183
Synonyms:
CHEMBL1269581 | N-(3-((2R,5S,8S,11S,14S,17S,23S,26S,29S,32S)-17-ethyl-14-((1R,2R)-1-hydroxy-2-methylhex-4-enyl)-5,8,23,29-tetraisobutyl-11,26-diisopropyl-4,7,10,13,19,22,28,32-octamethyl-3,6,9,12,15,18,21,24,27,30,33-undecaoxo-1,4,7,10,13,16,19,22,25,28,31-undecaazacyclotritriacontan-2-yl)propyl)pivalamide
Type:
Small organic molecule
Emp. Form.:
C69H124N12O13
Mol. Mass.:
1329.7955
SMILES:
CC[C@@H]1NC(=O)[C@H]([C@H](O)[C@H](C)C\C=C\C)N(C)C(=O)[C@H](C(C)C)N(C)C(=O)[C@H](CC(C)C)N(C)C(=O)[C@H](CC(C)C)N(C)C(=O)[C@@H](CCCNC(=O)C(C)(C)C)NC(=O)[C@H](C)NC(=O)[C@H](CC(C)C)N(C)C(=O)[C@@H](NC(=O)[C@H](CC(C)C)N(C)C(=O)CN(C)C1=O)C(C)C
: