Target
5-hydroxytryptamine receptor 1A
Ligand
BDBM50330475
Substrate
Meas. Tech.
ChEMBL_684850 (CHEMBL1286080)
IC50
64.6±n/a nM
Citation
 Asagarasu, AMatsui, THayashi, HTamaoki, SYamauchi, YMinato, KSato, M Discovery of a novel 5-HT(3) antagonist/5-HT(1A) agonist 3-amino-5,6,7,8-tetrahydro-2-{4-[4-(quinolin-2-yl)piperazin-1-yl]butyl}quinazolin-4(3H)-one (TZB-30878) as an orally bioavailable agent for irritable bowel syndrome. J Med Chem 53:7549-63 (2010)  
Target
Name:
5-hydroxytryptamine receptor 1A
Synonyms:
5-HT-1A 5-hydroxytryptamine receptor 1A (5-HT-1A) ADRB2RL1 Dopamine D2 receptor and serotonin 1a receptor HTR1A | Serotonin receptor 1A
Type:
Mol. Mass.:
46122.49
Organism:
Homo sapiens (Human)
Description:
Residue:
422
  
Inhibitor
Name:
BDBM50330475
Synonyms:
3-Amino-2-[4-[4-(3,4-dimethylquinolin-2-yl)piperazin-1-yl]butyl]-5,6,7,8-tetrahydro-3H-quinazolin-4-one | CHEMBL1277101
Type:
Small organic molecule
Emp. Form.:
C27H36N6O
Mol. Mass.:
460.6143
SMILES:
Cc1c(C)c2ccccc2nc1N1CCN(CCCCc2nc3CCCCc3c(=O)n2N)CC1
: