Target
Sialidase-3
Ligand
BDBM50331692
Substrate
Meas. Tech.
ChEMBL_687674 (CHEMBL1291058)
IC50
70000±n/a nM
Citation
 Zou, YAlbohy, ASandbhor, MCairo, CW Inhibition of human neuraminidase 3 (NEU3) by C9-triazole derivatives of 2,3-didehydro-N-acetyl-neuraminic acid. Bioorg Med Chem Lett 20:7529-33 (2010)  
Target
Name:
Sialidase-3
Synonyms:
NEU3 Sialidase 3 | Sialidase-3
Type:
PROTEIN
Mol. Mass.:
48257.99
Organism:
Homo sapiens (Human)
Description:
ChEMBL_461856
Residue:
428
  
Inhibitor
Name:
BDBM50331692
Synonyms:
(2R,3R,4S)-3-acetamido-2-((1R,2R)-3-azido-1,2-dihydroxypropyl)-4-hydroxy-3,4-dihydro-2H-pyran-6-carboxylate | CHEMBL1289311
Type:
Small organic molecule
Emp. Form.:
C11H16N4O7
Mol. Mass.:
316.2673
SMILES:
CC(=O)N[C@@H]1[C@@H](O)C=C(O[C@H]1[C@H](O)[C@H](O)CN=[N+]=[N-])C(O)=O
: