Target
Androgen receptor
Ligand
BDBM50331865
Substrate
Meas. Tech.
ChEMBL_687031 (CHEMBL1291551)
IC50
100±n/a nM
Citation
 Yoshino, HSato, HShiraishi, TTachibana, KEmura, THonma, AIshikura, NTsunenari, TWatanabe, MNishimoto, ANakamura, RNakagawa, TOhta, MTakata, NFurumoto, KKimura, KKawata, H Design and synthesis of an androgen receptor pure antagonist (CH5137291) for the treatment of castration-resistant prostate cancer. Bioorg Med Chem 18:8150-7 (2010)  
Target
Name:
Androgen receptor
Synonyms:
ANDR_HUMAN Androgen Receptor Androgen receptor/Baculoviral IAP repeat-containing protein 2 Dihydrotestosterone receptor Nuclear receptor subfamily 3 group C member 4
Type:
Receptor
Mol. Mass.:
99185.27
Organism:
Homo sapiens (Human)
Description:
CHO cells were stably transfected with human AR gene.
Residue:
920
  
Inhibitor
Name:
BDBM50331865
Synonyms:
4-(3-Phenyl-4,4-dimethyl-5-oxo-2-thioxoimidazolidin-1-yl)-2-trifluoromethylbenzonitrile CHEMBL1085883
Type:
Small organic molecule
Emp. Form.:
C19H14F3N3OS
Mol. Mass.:
389.394
SMILES:
CC1(C)N(C(=S)N(C1=O)c1ccc(C#N)c(c1)C(F)(F)F)c1ccccc1
: