Target
Carbonic anhydrase 2
Ligand
BDBM26981
Substrate
Meas. Tech.
ChEMBL_700700 (CHEMBL1645739)
Ki
26000000±n/a nM
Citation
 Ekinci, DCeyhun, SBSentürk, MErdem, DKüfrevioglu, OISupuran, CT Characterization and anions inhibition studies of ana-carbonic anhydrase from the teleost fish Dicentrarchus labrax. Bioorg Med Chem 19:744-8 (2011)  
Target
Name:
Carbonic anhydrase 2
Synonyms:
CA-II CAC Carbonate dehydratase II Carbonic anhydrase 2 (CA-II) Carbonic anhydrase C Carbonic anhydrase II (CA-II) Carbonic anhydrase II (hCA II) | Carbonic anhydrase isoenzyme II (hCA II)
Type:
Enzyme
Mol. Mass.:
29250.71
Organism:
Homo sapiens (Human)
Description:
P00918
Residue:
260
  
Inhibitor
Name:
BDBM26981
Synonyms:
CHEMBL1644695 POTASSIUM IODIDE iodide ion
Type:
Ion
Emp. Form.:
I
Mol. Mass.:
126.90502
SMILES:
[I-]
: